Reaction Details
TargetVascular endothelial growth factor receptor 2
LigandBDBM339846
Substrate/Competitorn/a
Meas. Tech.KDR (VEGFR2) (Enzymatic Assay)
IC50 10.7±n/a nM
Citation Angibaud, PRObringer, MMarin, JJJeanty, M Naphthyridine derivative compounds US Patent US9757364 Publication Date 9/12/2017
 
Vascular endothelial growth factor receptor 2
Name:Vascular endothelial growth factor receptor 2
Type:Receptor Tyrosine Kinase
Mol. Mass.:151510.97
Organism:Homo sapiens (Human)
Description:P35968
Residue:1356
BDBM339846
NameBDBM339846
Synonyms:US9757364, Compound 46
TypeSmall organic molecule
Emp. Form.C23H24F2N6O2
Mol. Mass.454.4725
SMILESCNCCN(c1ccc2ncc(cc2n1)-c1cnn(C)c1)c1c(F)c(OC)cc(OC)c1F