Reaction Details
TargetVascular endothelial growth factor receptor 2
LigandBDBM339848
Substrate/Competitorn/a
Meas. Tech.KDR (VEGFR2) (Enzymatic Assay)
IC50 20.0±n/a nM
Citation Angibaud, PRObringer, MMarin, JJJeanty, M Naphthyridine derivative compounds US Patent US9757364 Publication Date 9/12/2017
 
Vascular endothelial growth factor receptor 2
Name:Vascular endothelial growth factor receptor 2
Type:Receptor Tyrosine Kinase
Mol. Mass.:151510.97
Organism:Homo sapiens (Human)
Description:P35968
Residue:1356
BDBM339848
NameBDBM339848
Synonyms:US9757364, Compound 47
TypeSmall organic molecule
Emp. Form.C23H22N8O2
Mol. Mass.442.4732
SMILESCOc1cc(OC)cc(c1)N(Cc1nnc[nH]1)c1ccc2ncc(cc2n1)-c1cnn(C)c1