Reaction Details
TargetFibroblast growth factor receptor 4
LigandBDBM339849
Substrate/Competitorn/a
Meas. Tech.FGFR4 (Enzymatic Assay)
IC50 1.10±n/a nM
Citation Angibaud, PRObringer, MMarin, JJJeanty, M Naphthyridine derivative compounds US Patent US9757364 Publication Date 9/12/2017
 
Fibroblast growth factor receptor 4
Name:Fibroblast growth factor receptor 4
Type:Protein
Mol. Mass.:87957.45
Organism:Homo sapiens (Human)
Description:P22455
Residue:802
BDBM339849
NameBDBM339849
Synonyms:US9757364, Compound 48
TypeSmall organic molecule
Emp. Form.C23H21FN8O2
Mol. Mass.460.4636
SMILESCOc1cc(OC)c(F)c(c1)N(Cc1nnc[nH]1)c1ccc2ncc(cc2n1)-c1cnn(C)c1