Reaction Details
TargetFibroblast growth factor receptor 2
LigandBDBM339866
Substrate/Competitorn/a
Meas. Tech.FGFR2 (Enzymatic Assay)
IC50 2.19±n/a nM
Citation Angibaud, PRObringer, MMarin, JJJeanty, M Naphthyridine derivative compounds US Patent US9757364 Publication Date 9/12/2017
 
Fibroblast growth factor receptor 2
Name:Fibroblast growth factor receptor 2
Type:Enzyme
Mol. Mass.:92015.45
Organism:Homo sapiens (Human)
Description:P21802
Residue:821
BDBM339866
NameBDBM339866
Synonyms:US9757364, Compound 58
TypeSmall organic molecule
Emp. Form.C24H21FN6O3
Mol. Mass.460.4603
SMILESCOc1cc(OC)c(F)c(c1)N(Cc1ncco1)c1ccc2ncc(cc2n1)-c1cnn(C)c1