Reaction Details
TargetFibroblast growth factor receptor 1
LigandBDBM339868
Substrate/Competitorn/a
Meas. Tech.FGFR1 (Enzymatic Assay)
IC50 0.851±n/a nM
Citation Angibaud, PRObringer, MMarin, JJJeanty, M Naphthyridine derivative compounds US Patent US9757364 Publication Date 9/12/2017
 
Fibroblast growth factor receptor 1
Name:Fibroblast growth factor receptor 1
Type:Receptor
Mol. Mass.:91861.70
Organism:Homo sapiens (Human)
Description:P11362
Residue:822
BDBM339868
NameBDBM339868
Synonyms:US9757364, Compound 62
TypeSmall organic molecule
Emp. Form.C25H22N6O2
Mol. Mass.438.4812
SMILESCOc1cc(OC)cc(c1)N(Cc1ncc[nH]1)c1ccc2ncc(cc2n1)-c1ccncc1