Reaction Details
TargetFibroblast growth factor receptor 3
LigandBDBM339869
Substrate/Competitorn/a
Meas. Tech.FGFR3 (Enzymatic Assay)
IC50 1.20±n/a nM
Citation Angibaud, PRObringer, MMarin, JJJeanty, M Naphthyridine derivative compounds US Patent US9757364 Publication Date 9/12/2017
 
Fibroblast growth factor receptor 3
Name:Fibroblast growth factor receptor 3
Type:Protein
Mol. Mass.:87699.57
Organism:Homo sapiens (Human)
Description:P22607
Residue:806
BDBM339869
NameBDBM339869
Synonyms:US9757364, Compound 57
TypeSmall organic molecule
Emp. Form.C24H23FN6O2
Mol. Mass.446.4768
SMILESCOc1cc(OC)c(F)c(c1)N(CCCC#N)c1ccc2ncc(cc2n1)-c1cnn(C)c1