Reaction Details
TargetVascular endothelial growth factor receptor 2
LigandBDBM339869
Substrate/Competitorn/a
Meas. Tech.KDR (VEGFR2) (Enzymatic Assay)
IC50 7.24±n/a nM
Citation Angibaud, PRObringer, MMarin, JJJeanty, M Naphthyridine derivative compounds US Patent US9757364 Publication Date 9/12/2017
 
Vascular endothelial growth factor receptor 2
Name:Vascular endothelial growth factor receptor 2
Type:Receptor Tyrosine Kinase
Mol. Mass.:151510.97
Organism:Homo sapiens (Human)
Description:P35968
Residue:1356
BDBM339869
NameBDBM339869
Synonyms:US9757364, Compound 57
TypeSmall organic molecule
Emp. Form.C24H23FN6O2
Mol. Mass.446.4768
SMILESCOc1cc(OC)c(F)c(c1)N(CCCC#N)c1ccc2ncc(cc2n1)-c1cnn(C)c1