Reaction Details
TargetMuscarinic acetylcholine receptor M3
LigandBDBM339881
Substrate/Competitorn/a
Meas. Tech.Receptors Binding Assay
IC50 0.600±n/a nM
Citation Aiguade Bosch, JGual Roig, SPrat Quinones, MPuig Duran, C Cyclohexylamine derivatives having β2 adrenergic agonist and M3 muscarinic antagonist activities US Patent US9757383 Publication Date 9/12/2017
 
Muscarinic acetylcholine receptor M3
Name:Muscarinic acetylcholine receptor M3
Type:Enzyme
Mol. Mass.:66151.03
Organism:Homo sapiens (Human)
Description:P20309
Residue:590
BDBM339881
NameBDBM339881
Synonyms:US9757383, Example 4 | trans-4-[{3-[5-({[(2R)-2-hydroxy-2-(8-hydroxy-2-ox-1,2-dihydroquinolin-5-yl)ethyl]amino}methyl)-1H-indol-1-yl]propyl}(methyl)amino]cyclohexyl hydroxy(di-2-thienyl)acetate
TypeSmall organic molecule
Emp. Form.C40H46N4O5S2
Mol. Mass.726.947
SMILESCN(CCCn1ccc2cc(CNC[C@H](O)c3ccc(O)c4NCC=Cc34)ccc12)[C@H]1CC[C@@H](CC1)OC(=O)C(O)(c1cccs1)c1cccs1