Reaction Details
TargetCoagulation factor X
LigandBDBM12597
Substrate/CompetitorBDBM12593
Meas. Tech.Enzyme Assay and Determination of the Inhibition Constants.
pH7.5±n/a
Temperature295.15±n/a K
Ki 0.9±n/a nM
Citation Maignan, SGuilloteau, JPPouzieux, SChoi-Sledeski, YMBecker, MRKlein, SIEwing, WRPauls, HWSpada, APMikol, V Crystal structures of human factor Xa complexed with potent inhibitors. J Med Chem43:3226-32 (2000) 
 
Coagulation factor X
Name:Coagulation factor X
Type:Enzyme
Mol. Mass.:54726.60
Organism:Homo sapiens (Human)
Description:n/a
Residue:488
BDBM12597
BDBM12593
NameBDBM12597
Synonyms:CHEMBL48046 methyl (2R,3R)-2-{3-[amino(imino)methyl]benzyl}-3-({[3-(aminomethyl)-1,1-biphenyl-4-yl]carbonyl}amino)butanoate | methyl (2R,3R)-3-({4-[3-(aminomethyl)phenyl]phenyl}formamido)-2-[(3-carbamimidoylphenyl)methyl]butanoate
TypeSmall organic molecule
Emp. Form.C27H30N4O3
Mol. Mass.458.5521
SMILESCOC(=O)[C@H](Cc1cccc(c1)C(N)=N)[C@@H](C)NC(=O)c1ccc(cc1)-c1cccc(CN)c1