Reaction Details
TargetProthrombin
LigandBDBM14076
Substrate/CompetitorBDBM14064
Meas. Tech.Enzyme Inhibition Assay
pH7.4±n/a
Temperature310.15±n/a K
Ki 0.018±0.011 nM
IC50 5.3±0.4 nM
CommentsSlow tight binding inhibitor.
Citation Costanzo, MJAlmond, HRHecker, LRSchott, MRYabut, SCZhang, HCAndrade-Gordon, PCorcoran, TWGiardino, ECKauffman, JALewis, JMde Garavilla, LHaertlein, BJMaryanoff, BE In-depth study of tripeptide-based alpha-ketoheterocycles as inhibitors of thrombin. Effective utilization of the S1' subsite and its implications to structure-based drug design. J Med Chem48:1984-2008 (2005) 
 
Prothrombin
Name:Prothrombin
Type:Protein
Mol. Mass.:70029.57
Organism:Homo sapiens (Human)
Description:P00734
Residue:622
BDBM14076
BDBM14064
NameBDBM14076
Synonyms:(2S)-N-[(2S)-1-(1,3-benzothiazol-2-yl)-5-carbamimidamido-1-oxopentan-2-yl]-1-[(2R)-2-cyclohexyl-2-(methylamino)acetyl]pyrrolidine-2-carboxamide | 2-ketobenzothiazole 16
TypeSmall organic molecule
Emp. Form.C27H39N7O3S
Mol. Mass.541.709
SMILES[#6]-[#7]-[#6@H](-[#6]-1-[#6]-[#6]-[#6]-[#6]-[#6]-1)-[#6](=O)-[#7]-1-[#6]-[#6]-[#6]-[#6@H]-1-[#6](=O)-[#7]-[#6@@H](-[#6]-[#6]-[#6]\[#7]=[#6](\[#7])-[#7])-[#6](=O)-c1nc2ccccc2s1