Reaction Details
TargetProthrombin
LigandBDBM14117
Substrate/CompetitorBDBM14064
Meas. Tech.Enzyme Inhibition Assay
Ki 2.1±n/a nM
IC50 19±n/a nM
Citation Costanzo, MJAlmond, HRHecker, LRSchott, MRYabut, SCZhang, HCAndrade-Gordon, PCorcoran, TWGiardino, ECKauffman, JALewis, JMde Garavilla, LHaertlein, BJMaryanoff, BE In-depth study of tripeptide-based alpha-ketoheterocycles as inhibitors of thrombin. Effective utilization of the S1' subsite and its implications to structure-based drug design. J Med Chem48:1984-2008 (2005) 
 
Prothrombin
Name:Prothrombin
Type:Protein
Mol. Mass.:70029.57
Organism:Homo sapiens (Human)
Description:P00734
Residue:622
BDBM14117
BDBM14064
NameBDBM14117
Synonyms:(2S)-N-[5-carbamimidamido-1-oxo-1-(1,3-thiazol-2-yl)pentan-2-yl]-1-[(2R)-2-(methylamino)-3-phenylpropanoyl]pyrrolidine-2-carboxamide | 2-ketobenzothiazole 57
TypeSmall organic molecule
Emp. Form.C24H33N7O3S
Mol. Mass.499.629
SMILES[#6]-[#7]-[#6@H](-[#6]-c1ccccc1)-[#6](=O)-[#7]-1-[#6]-[#6]-[#6]-[#6@H]-1-[#6](=O)-[#7]-[#6](-[#6]-[#6]-[#6]\[#7]=[#6](/[#7])-[#7])-[#6](=O)-c1nccs1