Reaction Details
TargetProthrombin
LigandBDBM14137
Substrate/CompetitorBDBM14064
Meas. Tech.Enzyme Inhibition Assay
Ki 1.4±n/a nM
IC50 56±n/a nM
Citation Costanzo, MJAlmond, HRHecker, LRSchott, MRYabut, SCZhang, HCAndrade-Gordon, PCorcoran, TWGiardino, ECKauffman, JALewis, JMde Garavilla, LHaertlein, BJMaryanoff, BE In-depth study of tripeptide-based alpha-ketoheterocycles as inhibitors of thrombin. Effective utilization of the S1' subsite and its implications to structure-based drug design. J Med Chem48:1984-2008 (2005) 
 
Prothrombin
Name:Prothrombin
Type:Protein
Mol. Mass.:70029.57
Organism:Homo sapiens (Human)
Description:P00734
Residue:622
BDBM14137
BDBM14064
NameBDBM14137
Synonyms:2-ketobenzothiazole 75 | methyl (3S)-4-[(2S)-2-{[(2S)-1-(1,3-benzothiazol-2-yl)-5-carbamimidamido-1-oxopentan-2-yl]carbamoyl}pyrrolidin-1-yl]-4-oxo-3-(2-propylpentanamido)butanoate
TypeSmall organic molecule
Emp. Form.C31H45N7O6S
Mol. Mass.643.797
SMILES[#6]-[#6]-[#6]-[#6](-[#6]-[#6]-[#6])-[#6](=O)-[#7]-[#6@@H](-[#6]-[#6](=O)-[#8]-[#6])-[#6](=O)-[#7]-1-[#6]-[#6]-[#6]-[#6@H]-1-[#6](=O)-[#7]-[#6@@H](-[#6]-[#6]-[#6]\[#7]=[#6](\[#7])-[#7])-[#6](=O)-c1nc2ccccc2s1