Reaction Details
TargetSerine protease 1
LigandBDBM14078
Substrate/CompetitorBDBM14141
Meas. Tech.Enzyme Inhibition Assay
Ki 1.8±n/a nM
Citation Costanzo, MJAlmond, HRHecker, LRSchott, MRYabut, SCZhang, HCAndrade-Gordon, PCorcoran, TWGiardino, ECKauffman, JALewis, JMde Garavilla, LHaertlein, BJMaryanoff, BE In-depth study of tripeptide-based alpha-ketoheterocycles as inhibitors of thrombin. Effective utilization of the S1' subsite and its implications to structure-based drug design. J Med Chem48:1984-2008 (2005) 
 
Serine protease 1
Name:Serine protease 1
Type:Enzyme
Mol. Mass.:25790.52
Organism:Bos taurus (bovine)
Description:P00760
Residue:246
BDBM14078
BDBM14141
NameBDBM14078
Synonyms:(2S)-1-(2-amino-2,2-diphenylacetyl)-N-[1-(1,3-benzothiazol-2-yl)-5-carbamimidamido-1-oxopentan-2-yl]pyrrolidine-2-carboxamide | 2-ketobenzothiazole 18
TypeSmall organic molecule
Emp. Form.C32H35N7O3S
Mol. Mass.597.73
SMILES[#7]\[#6](-[#7])=[#7]\[#6]-[#6]-[#6]-[#6](-[#7]-[#6](=O)-[#6@@H]-1-[#6]-[#6]-[#6]-[#7]-1-[#6](=O)C([#7])(c1ccccc1)c1ccccc1)-[#6](=O)-c1nc2ccccc2s1