Reaction Details
TargetSodium channel protein type 10 subunit alpha
LigandBDBM161326
Substrate/Competitorn/a
Meas. Tech.Electrophysiology Assay
IC50 3.00±n/a nM
Citation Hadida-Ruah, SSAnderson, CArumugam, VAsgian, ILBear, BRTermin, APJohnson, JP Pyridone amides as modulators of sodium channels US Patent US9758483 Publication Date 9/12/2017
 
Sodium channel protein type 10 subunit alpha
Name:Sodium channel protein type 10 subunit alpha
Type:Enzyme
Mol. Mass.:220609.21
Organism:Homo sapiens (Human)
Description:Q9Y5Y9
Residue:1956
BDBM161326
NameBDBM161326
Synonyms:US10087143, Compound 111 US10787472, Compound 2a US9051270, 111 US9758483, Compound 111
TypeSmall organic molecule
Emp. Form.C21H14F6N2O4
Mol. Mass.472.3373
SMILESCOc1cc(F)ccc1Oc1cc(ccc1C(=O)Nc1cc[nH]c(=O)c1)C(F)(F)C(F)(F)F