Reaction Details
TargetSodium channel protein type 10 subunit alpha
LigandBDBM161373
Substrate/Competitorn/a
Meas. Tech.Electrophysiology Assay
IC50 2.00±n/a nM
Citation Hadida-Ruah, SSAnderson, CArumugam, VAsgian, ILBear, BRTermin, APJohnson, JP Pyridone amides as modulators of sodium channels US Patent US9758483 Publication Date 9/12/2017
 
Sodium channel protein type 10 subunit alpha
Name:Sodium channel protein type 10 subunit alpha
Type:Enzyme
Mol. Mass.:220609.21
Organism:Homo sapiens (Human)
Description:Q9Y5Y9
Residue:1956
BDBM161373
NameBDBM161373
Synonyms:US10087143, Compound 158 US11673864, Compound 158 US9758483, Compound 158
TypeSmall organic molecule
Emp. Form.C20H14F4N2O4
Mol. Mass.422.3298
SMILESCOc1cc(F)ccc1Oc1cc(ccc1C(=O)Nc1cc[nH]c(=O)c1)C(F)(F)F