Reaction Details
TargetTryptophan 2,3-dioxygenase
LigandBDBM339941
Substrate/Competitorn/a
Meas. Tech.Enzymatic Activity Assay
IC50 540±n/a nM
Citation Crosignani, SCauwenberghs, SDriessens, GDeroose, F 3-(indol-3-yl)-pyridine derivatives, pharmaceutical compositions and methods for use US Patent US9758505 Publication Date 9/12/2017
 
Tryptophan 2,3-dioxygenase
Name:Tryptophan 2,3-dioxygenase
Type:PROTEIN
Mol. Mass.:47874.48
Organism:Homo sapiens (Human)
Description:ChEMBL_825691
Residue:406
BDBM339941
NameBDBM339941
Synonyms:4-(5-(6-fluoro-1H-indol-3- yl)pyridin-2-yl)morpholine | US9758505, 9
TypeSmall organic molecule
Emp. Form.C17H16FN3O
Mol. Mass.297.3268
SMILESFc1ccc2c(c[nH]c2c1)-c1ccc(nc1)N1CCOCC1