Reaction Details
TargetProto-oncogene tyrosine-protein kinase Src
LigandBDBM340137
Substrate/Competitorn/a
Meas. Tech.Src Enzyme Activity
EC50>1000±n/a nM
Citation Barf, TAJans, CGde Man, APOubrie, AARaaijmakers, HCRewinkel, JBSterrenburg, JGWijkmans, JC 4-imidazopyridazin-1-yl-benzamides as Btk inhibitors US Patent US9758524 Publication Date 9/12/2017
 
Proto-oncogene tyrosine-protein kinase Src
Name:Proto-oncogene tyrosine-protein kinase Src
Type:Protein
Mol. Mass.:59838.60
Organism:Homo sapiens (Human)
Description:P12931
Residue:536
BDBM340137
NameBDBM340137
Synonyms:US10239883, Example 26 US9758524, Example 26
TypeSmall organic molecule
Emp. Form.C29H30FN7O2
Mol. Mass.527.5926
SMILESCCCc1ccnc(NC(=O)c2ccc(cc2F)-c2nc([C@@H]3CCCCN3C(=O)C=C)n3ccnc(N)c23)c1