Reaction Details
TargetTyrosine-protein kinase Fyn
LigandBDBM340081
Substrate/Competitorn/a
Meas. Tech.FynT Enzyme Activity
EC50>1000±n/a nM
Citation Barf, TAJans, CGde Man, APOubrie, AARaaijmakers, HCRewinkel, JBSterrenburg, JGWijkmans, JC 4-imidazopyridazin-1-yl-benzamides as Btk inhibitors US Patent US9758524 Publication Date 9/12/2017
 
Tyrosine-protein kinase Fyn
Name:Tyrosine-protein kinase Fyn
Type:Enzyme
Mol. Mass.:60762.21
Organism:Homo sapiens (Human)
Description:P06241
Residue:537
BDBM340081
NameBDBM340081
Synonyms:US10239883, Example 4 US9758524, Example 4
TypeSmall organic molecule
Emp. Form.C27H27N7O3
Mol. Mass.497.5484
SMILESCOC\C=C\C(=O)N1CCC[C@H]1c1nc(-c2ccc(cc2)C(=O)Nc2ccccn2)c2c(N)nccn12