Reaction Details
TargetTyrosine-protein kinase Fyn
LigandBDBM340082
Substrate/Competitorn/a
Meas. Tech.FynT Enzyme Activity
EC50>1000±n/a nM
Citation Barf, TAJans, CGde Man, APOubrie, AARaaijmakers, HCRewinkel, JBSterrenburg, JGWijkmans, JC 4-imidazopyridazin-1-yl-benzamides as Btk inhibitors US Patent US9758524 Publication Date 9/12/2017
 
Tyrosine-protein kinase Fyn
Name:Tyrosine-protein kinase Fyn
Type:Enzyme
Mol. Mass.:60762.21
Organism:Homo sapiens (Human)
Description:P06241
Residue:537
BDBM340082
NameBDBM340082
Synonyms:US10239883, Example 5 US9758524, Example 5
TypeSmall organic molecule
Emp. Form.C27H22ClN9O2
Mol. Mass.539.976
SMILESNc1nccn2c(nc(-c3ccc(cc3)C(=O)Nc3ccccn3)c12)[C@@H]1CCCN1C(=O)c1ccnc(Cl)n1