Reaction Details
TargetTyrosine-protein kinase Fyn
LigandBDBM340124
Substrate/Competitorn/a
Meas. Tech.FynT Enzyme Activity
EC50>1000±n/a nM
Citation Barf, TAJans, CGde Man, APOubrie, AARaaijmakers, HCRewinkel, JBSterrenburg, JGWijkmans, JC 4-imidazopyridazin-1-yl-benzamides as Btk inhibitors US Patent US9758524 Publication Date 9/12/2017
 
Tyrosine-protein kinase Fyn
Name:Tyrosine-protein kinase Fyn
Type:Enzyme
Mol. Mass.:60762.21
Organism:Homo sapiens (Human)
Description:P06241
Residue:537
BDBM340124
NameBDBM340124
Synonyms:US10239883, Example 12 US9758524, Example 12
TypeSmall organic molecule
Emp. Form.C28H27N7O2S
Mol. Mass.525.625
SMILESCC#CC(=O)N1CCC[C@H]1c1nc(-c2ccc(cc2)C(=O)Nc2nc3CCCCc3s2)c2c(N)nccn12