Reaction Details
TargetTyrosine-protein kinase Fyn
LigandBDBM340134
Substrate/Competitorn/a
Meas. Tech.FynT Enzyme Activity
EC50>1000±n/a nM
Citation Barf, TAJans, CGde Man, APOubrie, AARaaijmakers, HCRewinkel, JBSterrenburg, JGWijkmans, JC 4-imidazopyridazin-1-yl-benzamides as Btk inhibitors US Patent US9758524 Publication Date 9/12/2017
 
Tyrosine-protein kinase Fyn
Name:Tyrosine-protein kinase Fyn
Type:Enzyme
Mol. Mass.:60762.21
Organism:Homo sapiens (Human)
Description:P06241
Residue:537
BDBM340134
NameBDBM340134
Synonyms:US10239883, Example 22 US9758524, Example 22
TypeSmall organic molecule
Emp. Form.C26H24N8O2
Mol. Mass.480.5212
SMILESCC#CC(=O)N1CCCC[C@H]1c1nc(-c2ccc(cc2)C(=O)Nc2ccncn2)c2c(N)nccn12