Reaction Details
TargetTyrosine-protein kinase Fyn
LigandBDBM340149
Substrate/Competitorn/a
Meas. Tech.FynT Enzyme Activity
EC50>1000±n/a nM
Citation Barf, TAJans, CGde Man, APOubrie, AARaaijmakers, HCRewinkel, JBSterrenburg, JGWijkmans, JC 4-imidazopyridazin-1-yl-benzamides as Btk inhibitors US Patent US9758524 Publication Date 9/12/2017
 
Tyrosine-protein kinase Fyn
Name:Tyrosine-protein kinase Fyn
Type:Enzyme
Mol. Mass.:60762.21
Organism:Homo sapiens (Human)
Description:P06241
Residue:537
BDBM340149
NameBDBM340149
Synonyms:US10239883, Example 38 US9758524, Example 38
TypeSmall organic molecule
Emp. Form.C26H23N7O3
Mol. Mass.481.5059
SMILESCC#CC(=O)N1CCOC[C@H]1c1nc(-c2ccc(cc2)C(=O)Nc2ccccn2)c2c(N)nccn12