Reaction Details
TargetTyrosine-protein kinase Lyn
LigandBDBM50175583
Substrate/Competitorn/a
Meas. Tech.Lyn Enzyme Activity
EC50>1000±n/a nM
Citation Barf, TAJans, CGde Man, APOubrie, AARaaijmakers, HCRewinkel, JBSterrenburg, JGWijkmans, JC 4-imidazopyridazin-1-yl-benzamides as Btk inhibitors US Patent US9758524 Publication Date 9/12/2017
 
Tyrosine-protein kinase Lyn
Name:Tyrosine-protein kinase Lyn
Type:Protein
Mol. Mass.:58575.92
Organism:Homo sapiens (Human)
Description:P07948
Residue:512
BDBM50175583
NameBDBM50175583
Synonyms:ACP-196 US10239883, Example 6 US10919899, ACP-196 US11420975, Acalabrutinlb | US9758524, Example 6
TypeSmall organic molecule
Emp. Form.C26H23N7O2
Mol. Mass.465.5065
SMILES[H][C@]1(CCCN1C(=O)C#CC)c1nc(-c2ccc(cc2)C(=O)Nc2ccccn2)c2c(N)nccn12