Reaction Details
TargetTyrosine-protein kinase Lyn
LigandBDBM340150
Substrate/Competitorn/a
Meas. Tech.Lyn Enzyme Activity
EC50>1000±n/a nM
Citation Barf, TAJans, CGde Man, APOubrie, AARaaijmakers, HCRewinkel, JBSterrenburg, JGWijkmans, JC 4-imidazopyridazin-1-yl-benzamides as Btk inhibitors US Patent US9758524 Publication Date 9/12/2017
 
Tyrosine-protein kinase Lyn
Name:Tyrosine-protein kinase Lyn
Type:Protein
Mol. Mass.:58575.92
Organism:Homo sapiens (Human)
Description:P07948
Residue:512
BDBM340150
NameBDBM340150
Synonyms:US10239883, Example 39 US9758524, Example 39
TypeSmall organic molecule
Emp. Form.C26H22F3N7O2
Mol. Mass.521.4938
SMILESCC#CC(=O)N(C)[C@@H](C)c1nc(-c2ccc(cc2)C(=O)Nc2cc(ccn2)C(F)(F)F)c2c(N)nccn12