Reaction Details
TargetTyrosine-protein kinase Lyn
LigandBDBM340151
Substrate/Competitorn/a
Meas. Tech.Lyn Enzyme Activity
EC50>1000±n/a nM
Citation Barf, TAJans, CGde Man, APOubrie, AARaaijmakers, HCRewinkel, JBSterrenburg, JGWijkmans, JC 4-imidazopyridazin-1-yl-benzamides as Btk inhibitors US Patent US9758524 Publication Date 9/12/2017
 
Tyrosine-protein kinase Lyn
Name:Tyrosine-protein kinase Lyn
Type:Protein
Mol. Mass.:58575.92
Organism:Homo sapiens (Human)
Description:P07948
Residue:512
BDBM340151
NameBDBM340151
Synonyms:(S)-4-(3-(1-acryloylpyrrolidin-2-yl)- 8-aminoimidazo[1,5-a]pyrazin-1-yl)- N-(4-fluoropyridin-2-yl)benzamide US10934296, Example 42 | US9758524, Example 42
TypeSmall organic molecule
Emp. Form.C25H22FN7O2
Mol. Mass.471.4863
SMILESNc1nccn2c(nc(-c3ccc(cc3)C(=O)Nc3cc(F)ccn3)c12)[C@@H]1CCCN1C(=O)C=C