Reaction Details
TargetTyrosine-protein kinase Lyn
LigandBDBM340153
Substrate/Competitorn/a
Meas. Tech.Lyn Enzyme Activity
EC50>1000±n/a nM
Citation Barf, TAJans, CGde Man, APOubrie, AARaaijmakers, HCRewinkel, JBSterrenburg, JGWijkmans, JC 4-imidazopyridazin-1-yl-benzamides as Btk inhibitors US Patent US9758524 Publication Date 9/12/2017
 
Tyrosine-protein kinase Lyn
Name:Tyrosine-protein kinase Lyn
Type:Protein
Mol. Mass.:58575.92
Organism:Homo sapiens (Human)
Description:P07948
Residue:512
BDBM340153
NameBDBM340153
Synonyms:(S)-4-(8-amino-3-(1-but-2- ynoylpiperidin-2-yl)imidazo[1,5- a]pyrazin-1-yl)-N-(4-fluoropyridin-2- yl)benzamide US10934296, Example 44 | US9758524, Example 44
TypeSmall organic molecule
Emp. Form.C27H24FN7O2
Mol. Mass.497.5236
SMILESCC#CC(=O)N1CCCC[C@H]1c1nc(-c2ccc(cc2)C(=O)Nc2cc(F)ccn2)c2c(N)nccn12