Reaction Details
TargetTyrosine-protein kinase Lyn
LigandBDBM340095
Substrate/Competitorn/a
Meas. Tech.Lyn Enzyme Activity
EC50 550±n/a nM
Citation Barf, TAJans, CGde Man, APOubrie, AARaaijmakers, HCRewinkel, JBSterrenburg, JGWijkmans, JC 4-imidazopyridazin-1-yl-benzamides as Btk inhibitors US Patent US9758524 Publication Date 9/12/2017
 
Tyrosine-protein kinase Lyn
Name:Tyrosine-protein kinase Lyn
Type:Protein
Mol. Mass.:58575.92
Organism:Homo sapiens (Human)
Description:P07948
Residue:512
BDBM340095
NameBDBM340095
Synonyms:(S)-4-(8-amino-3-(1-but-2- ynoylpyrrolidin-2-yl)imidazo[1,5- a]pyrazin-1-yl)-N-(thiazol-2- yl)benzamide US10934296, Example 60 | US9758524, Example 60
TypeSmall organic molecule
Emp. Form.C24H21N7O2S
Mol. Mass.471.534
SMILESCC#CC(=O)N1CCC[C@H]1c1nc(-c2ccc(cc2)C(=O)Nc2nccs2)c2c(N)nccn12