Reaction Details
TargetTissue-type plasminogen activator
LigandBDBM14156
Substrate/CompetitorBDBM12774
Meas. Tech.Enzyme Assay and Determination of the Inhibition Constants
Ki 290±n/a nM
Citation Katz, BASprengeler, PALuong, CVerner, EElrod, KKirtley, MJanc, JSpencer, JRBreitenbucher, JGHui, HMcGee, DAllen, DMartelli, AMackman, RL Engineering inhibitors highly selective for the S1 sites of Ser190 trypsin-like serine protease drug targets. Chem Biol8:1107-21 (2001) 
 
Tissue-type plasminogen activator
Name:Tissue-type plasminogen activator
Type:Enzyme
Mol. Mass.:62931.08
Organism:Homo sapiens (Human)
Description:n/a
Residue:562
BDBM14156
BDBM12774
NameBDBM14156
Synonyms:3-bromo-N-(4-carbamimidoylphenyl)-2-hydroxy-5-methylbenzamide CHEMBL61327
TypeSmall organic molecule
Emp. Form.C15H14BrN3O2
Mol. Mass.348.195
SMILESCc1cc(Br)c(O)c(c1)C(=O)Nc1ccc(cc1)C(N)=N