Reaction Details
TargetPhosphatidylinositol 3-kinase regulatory subunit alpha
LigandBDBM340384
Substrate/Competitorn/a
Meas. Tech.Biochemical Assay
Ki<0.018±n/a nM
Citation Chen, PCheng, HGallego, GMJalaie, MKath, JCOrr, STPairish, MA Pyrimidine derivatives US Patent US9758538 Publication Date 9/12/2017
 
Phosphatidylinositol 3-kinase regulatory subunit alpha
Name:Phosphatidylinositol 3-kinase regulatory subunit alpha
Type:Protein
Mol. Mass.:83592.82
Organism:Homo sapiens (Human)
Description:P27986
Residue:724
BDBM340384
NameBDBM340384
Synonyms:US9758538, Example 72
TypeSmall organic molecule
Emp. Form.C19H25FN8O4
Mol. Mass.448.4514
SMILESCOC(=O)N1CC[C@@](CO)(C1)Nc1nc(nc(c1F)-c1cnc(N)nc1)N1CCOCC1