Reaction Details
TargetPhosphatidylinositol 3-kinase regulatory subunit alpha
LigandBDBM340430
Substrate/Competitorn/a
Meas. Tech.Biochemical Assay
Ki<0.018±n/a nM
Citation Chen, PCheng, HGallego, GMJalaie, MKath, JCOrr, STPairish, MA Pyrimidine derivatives US Patent US9758538 Publication Date 9/12/2017
 
Phosphatidylinositol 3-kinase regulatory subunit alpha
Name:Phosphatidylinositol 3-kinase regulatory subunit alpha
Type:Protein
Mol. Mass.:83592.82
Organism:Homo sapiens (Human)
Description:P27986
Residue:724
BDBM340430
NameBDBM340430
Synonyms:US9758538, Example 119
TypeSmall organic molecule
Emp. Form.C21H27F3N8O4
Mol. Mass.512.4855
SMILESC[C@H]1COCCN1c1nc(N[C@@]2(CO)CCN(C2)C(=O)OCC(F)F)c(F)c(n1)-c1cnc(N)nc1