Reaction Details
TargetCREB-binding protein
LigandBDBM340521
Substrate/Competitorn/a
Meas. Tech.TR-FRET Binding Assay
IC50 10.00±n/a nM
Citation Adler, MAlbrecht, BKBronner, SChen, KXCôté, ACrawford, TCyr, PEgen, JKauder, SLai, KWLiao, JMagnuson, SMurray, JPastor, RRomero, FATaylor, AMTsui, VHWang, FZhu, B Therapeutic compounds and uses thereof US Patent US9763922 Publication Date 9/19/2017
 
CREB-binding protein
Name:CREB-binding protein
Type:Transcription Coactivator
Mol. Mass.:265411.66
Organism:Homo sapiens (Human)
Description:Q92793
Residue:2442
BDBM340521
NameBDBM340521
Synonyms:US9763922, Example 52
TypeSmall organic molecule
Emp. Form.C22H25FN6O2
Mol. Mass.424.4713
SMILESCC(=O)N1CCc2c(C1)c(Nc1ccc(-c3cnn(C)c3)c(F)c1)nn2C1CCOC1