Reaction Details
TargetCREB-binding protein
LigandBDBM340735
Substrate/Competitorn/a
Meas. Tech.TR-FRET Binding Assay
IC50 3.00±n/a nM
Citation Adler, MAlbrecht, BKBronner, SChen, KXCôté, ACrawford, TCyr, PEgen, JKauder, SLai, KWLiao, JMagnuson, SMurray, JPastor, RRomero, FATaylor, AMTsui, VHWang, FZhu, B Therapeutic compounds and uses thereof US Patent US9763922 Publication Date 9/19/2017
 
CREB-binding protein
Name:CREB-binding protein
Type:Transcription Coactivator
Mol. Mass.:265411.66
Organism:Homo sapiens (Human)
Description:Q92793
Residue:2442
BDBM340735
NameBDBM340735
Synonyms:US9763922, Example 261
TypeSmall organic molecule
Emp. Form.C23H26F3N7O2
Mol. Mass.489.4934
SMILESCNC(=O)N1CCc2c(C1)c(Nc1cc(C(F)F)c(cc1F)-c1cnn(C)c1)nn2[C@H]1CCOC1