Reaction Details
TargetHigh affinity nerve growth factor receptor
LigandBDBM249337
Substrate/Competitorn/a
Meas. Tech.Inhibtion Assay
IC50 0.500±n/a nM
Citation Takeuchi, JItadani, SHashimura, KIkura, MHigashino, MYasuhiro, TNagaura, T Trk-inhibiting compound US Patent US9763943 Publication Date 9/19/2017
 
High affinity nerve growth factor receptor
Name:High affinity nerve growth factor receptor
Type:n/a
Mol. Mass.:87498.18
Organism:Homo sapiens (Human)
Description:P04629
Residue:796
BDBM249337
NameBDBM249337
Synonyms:US10300060, Example 15-104 US9463192, 15-104 US9993479, 15-104
TypeSmall organic molecule
Emp. Form.C24H18ClF3N6O4S
Mol. Mass.578.951
SMILESCS(=O)(=O)c1ccc(cc1NC(=O)Nc1cnc(Oc2ccc(cc2)-c2cc(Cl)cnc2N)nc1)C(F)(F)F