Reaction Details
TargetPhosphatidylinositol 4,5-bisphosphate 3-kinase catalytic subunit delta isoform
LigandBDBM204102
Substrate/Competitorn/a
IC50<3.00±n/a nM
Citation Caravatti, GChamoin, SFuret, PHogenauer, KHurth, KKammertoens, KLewis, IMoebitz, HSmith, ABSoldermann, NWolf, RZecri, F Dihydro-benzo-oxazine and dihydro-pyrido-oxazine derivatives US Patent US9763952 Publication Date 9/19/2017
 
Phosphatidylinositol 4,5-bisphosphate 3-kinase catalytic subunit delta isoform
Name:Phosphatidylinositol 4,5-bisphosphate 3-kinase catalytic subunit delta isoform
Type:Enzyme Subunit
Mol. Mass.:119489.41
Organism:Homo sapiens (Human)
Description:O00329
Residue:1044
BDBM204102
NameBDBM204102
Synonyms:US9539260, H3 US9763952, Example H4
TypeSmall organic molecule
Emp. Form.C24H29N3O7S
Mol. Mass.503.568
SMILESCc1cc(cnc1S(C)(=O)=O)N1CCOc2ccc(O[C@H]3CCN(C3)C(=O)C3COCCO3)cc12