Reaction Details
TargetCalcium-dependent protein kinase 1
LigandBDBM50345720
Substrate/Competitorn/a
Meas. Tech.Biological Assay
IC50 75.0±n/a nM
Citation Van Voorhis, WCHol, WGLarson, ETMaly, DJMerritt, EOjo, KK Compositions and methods for treating toxoplasmosis, cryptosporidiosis, and other apicomplexan protozoan related diseases US Patent US9765037 Publication Date 9/19/2017
 
Calcium-dependent protein kinase 1
Name:Calcium-dependent protein kinase 1
Synonyms:Calcium-dependent protein kinase 1 (CDPK1)
Type:Protein
Mol. Mass.:76617.33
Organism:Cryptosporidium parvum
Description:Q6S4W0
Residue:677
BDBM50345720
NameBDBM50345720
TypeSmall organic molecule
Emp. Form.C22H24N6O2S
Mol. Mass.436.53
SMILESCS(=O)(=O)N1CCC(CC1)n1nc(Cc2cccc3ccccc23)c2c(N)ncnc12