Reaction Details
TargetCalcium-dependent protein kinase 1
LigandBDBM50345735
Substrate/Competitorn/a
Meas. Tech.Biological Assay
IC50 17.0±n/a nM
Citation Van Voorhis, WCHol, WGLarson, ETMaly, DJMerritt, EOjo, KK Compositions and methods for treating toxoplasmosis, cryptosporidiosis, and other apicomplexan protozoan related diseases US Patent US9765037 Publication Date 9/19/2017
 
Calcium-dependent protein kinase 1
Name:Calcium-dependent protein kinase 1
Synonyms:Calcium-dependent protein kinase 1 (CDPK1)
Type:Protein
Mol. Mass.:76617.33
Organism:Cryptosporidium parvum
Description:Q6S4W0
Residue:677
BDBM50345735
NameBDBM50345735
TypeSmall organic molecule
Emp. Form.C16H19N5O
Mol. Mass.297.355
SMILESCOc1ccc(cc1C)-c1nn(C(C)C)c2ncnc(N)c12