Reaction Details
TargetCalcium-dependent protein kinase 1
LigandBDBM50345739
Substrate/Competitorn/a
Meas. Tech.Biological Assay
IC50 5.00±n/a nM
Citation Van Voorhis, WCHol, WGLarson, ETMaly, DJMerritt, EOjo, KK Compositions and methods for treating toxoplasmosis, cryptosporidiosis, and other apicomplexan protozoan related diseases US Patent US9765037 Publication Date 9/19/2017
 
Calcium-dependent protein kinase 1
Name:Calcium-dependent protein kinase 1
Synonyms:Calcium-dependent protein kinase 1 (CDPK1)
Type:Protein
Mol. Mass.:76617.33
Organism:Cryptosporidium parvum
Description:Q6S4W0
Residue:677
BDBM50345739
NameBDBM50345739
TypeSmall organic molecule
Emp. Form.C19H19N5O
Mol. Mass.333.3871
SMILESCOc1ccc2cc(ccc2c1)-c1nn(C(C)C)c2ncnc(N)c12