Reaction Details
TargetCalmodulin-domain protein kinase 1
LigandBDBM340899
Substrate/Competitorn/a
Meas. Tech.Biological Assay
IC50 3.80±n/a nM
Citation Van Voorhis, WCHol, WGLarson, ETMaly, DJMerritt, EOjo, KK Compositions and methods for treating toxoplasmosis, cryptosporidiosis, and other apicomplexan protozoan related diseases US Patent US9765037 Publication Date 9/19/2017
 
Calmodulin-domain protein kinase 1
Name:Calmodulin-domain protein kinase 1
Type:Enzyme Catalytic Domain
Mol. Mass.:57248.42
Organism:Toxoplasma gondii
Description:n/a
Residue:507
BDBM340899
NameBDBM340899
Synonyms:1-isopropyl-3-(4-methyl-1H-indol-2-yl)-1H- pyrazolo[3,4-d]pyrimidin-4-amine US11247972, Compound 25 | US9765037, Compound 25
TypeSmall organic molecule
Emp. Form.C17H18N6
Mol. Mass.306.365
SMILESCC(C)n1nc(-c2cc3c(C)cccc3[nH]2)c2c(N)ncnc12