Reaction Details
TargetCalcium-dependent protein kinase 1
LigandBDBM340899
Substrate/Competitorn/a
Meas. Tech.Biological Assay
IC50 7.30±n/a nM
Citation Van Voorhis, WCHol, WGLarson, ETMaly, DJMerritt, EOjo, KK Compositions and methods for treating toxoplasmosis, cryptosporidiosis, and other apicomplexan protozoan related diseases US Patent US9765037 Publication Date 9/19/2017
 
Calcium-dependent protein kinase 1
Name:Calcium-dependent protein kinase 1
Synonyms:Calcium-dependent protein kinase 1 (CDPK1)
Type:Protein
Mol. Mass.:76617.33
Organism:Cryptosporidium parvum
Description:Q6S4W0
Residue:677
BDBM340899
NameBDBM340899
TypeSmall organic molecule
Emp. Form.C17H18N6
Mol. Mass.306.365
SMILESCC(C)n1nc(-c2cc3c(C)cccc3[nH]2)c2c(N)ncnc12