Reaction Details
TargetCalmodulin-domain protein kinase 1
LigandBDBM50383380
Substrate/Competitorn/a
Meas. Tech.Biological Assay
IC50 4.90±n/a nM
Citation Van Voorhis, WCHol, WGLarson, ETMaly, DJMerritt, EOjo, KK Compositions and methods for treating toxoplasmosis, cryptosporidiosis, and other apicomplexan protozoan related diseases US Patent US9765037 Publication Date 9/19/2017
 
Calmodulin-domain protein kinase 1
Name:Calmodulin-domain protein kinase 1
Type:Enzyme Catalytic Domain
Mol. Mass.:57248.42
Organism:Toxoplasma gondii
Description:n/a
Residue:507
BDBM50383380
NameBDBM50383380
Synonyms:CHEMBL2030553 US10544104, Compound 28 US9765037, Compound 28
TypeSmall organic molecule
Emp. Form.C22H24N6O
Mol. Mass.388.4656
SMILESCOc1ccc2cc(ccc2c1)-c1nn(CC2CCNCC2)c2ncnc(N)c12