Reaction Details
TargetCalmodulin-domain protein kinase 1
LigandBDBM50389686
Substrate/Competitorn/a
Meas. Tech.Biological Assay
IC50 3.80±n/a nM
Citation Van Voorhis, WCHol, WGLarson, ETMaly, DJMerritt, EOjo, KK Compositions and methods for treating toxoplasmosis, cryptosporidiosis, and other apicomplexan protozoan related diseases US Patent US9765037 Publication Date 9/19/2017
 
Calmodulin-domain protein kinase 1
Name:Calmodulin-domain protein kinase 1
Type:Enzyme Catalytic Domain
Mol. Mass.:57248.42
Organism:Toxoplasma gondii
Description:n/a
Residue:507
BDBM50389686
NameBDBM50389686
Synonyms:CHEMBL2070053 US11247972, Compound 32 | US9765037, Compound 32
TypeSmall organic molecule
Emp. Form.C24H28N6O
Mol. Mass.416.5187
SMILESCC(C)Oc1ccc2cc(ccc2c1)-c1nn(CC2CCNCC2)c2ncnc(N)c12