Reaction Details
TargetCalcium-dependent protein kinase 1
LigandBDBM50389686
Substrate/Competitorn/a
Meas. Tech.Biological Assay
IC50 5.10±n/a nM
Citation Van Voorhis, WCHol, WGLarson, ETMaly, DJMerritt, EOjo, KK Compositions and methods for treating toxoplasmosis, cryptosporidiosis, and other apicomplexan protozoan related diseases US Patent US9765037 Publication Date 9/19/2017
 
Calcium-dependent protein kinase 1
Name:Calcium-dependent protein kinase 1
Synonyms:Calcium-dependent protein kinase 1 (CDPK1)
Type:Protein
Mol. Mass.:76617.33
Organism:Cryptosporidium parvum
Description:Q6S4W0
Residue:677
BDBM50389686
NameBDBM50389686
TypeSmall organic molecule
Emp. Form.C24H28N6O
Mol. Mass.416.5187
SMILESCC(C)Oc1ccc2cc(ccc2c1)-c1nn(CC2CCNCC2)c2ncnc(N)c12