Reaction Details
TargetCalmodulin-domain protein kinase 1
LigandBDBM50389700
Substrate/Competitorn/a
Meas. Tech.Biological Assay
IC50 0.700±n/a nM
Citation Van Voorhis, WCHol, WGLarson, ETMaly, DJMerritt, EOjo, KK Compositions and methods for treating toxoplasmosis, cryptosporidiosis, and other apicomplexan protozoan related diseases US Patent US9765037 Publication Date 9/19/2017
 
Calmodulin-domain protein kinase 1
Name:Calmodulin-domain protein kinase 1
Type:Enzyme Catalytic Domain
Mol. Mass.:57248.42
Organism:Toxoplasma gondii
Description:n/a
Residue:507
BDBM50389700
NameBDBM50389700
Synonyms:CHEMBL2070067 US11247972, Compound 38 | US9765037, Compound 38
TypeSmall organic molecule
Emp. Form.C28H27ClN6O
Mol. Mass.499.007
SMILESNc1ncnc2n(CC3CCNCC3)nc(-c3ccc4cc(OCc5cccc(Cl)c5)ccc4c3)c12