Reaction Details
TargetCalcium-dependent protein kinase 1
LigandBDBM50389687
Substrate/Competitorn/a
Meas. Tech.Biological Assay
IC50 4.10±n/a nM
Citation Van Voorhis, WCHol, WGLarson, ETMaly, DJMerritt, EOjo, KK Compositions and methods for treating toxoplasmosis, cryptosporidiosis, and other apicomplexan protozoan related diseases US Patent US9765037 Publication Date 9/19/2017
 
Calcium-dependent protein kinase 1
Name:Calcium-dependent protein kinase 1
Synonyms:Calcium-dependent protein kinase 1 (CDPK1)
Type:Protein
Mol. Mass.:76617.33
Organism:Cryptosporidium parvum
Description:Q6S4W0
Residue:677
BDBM50389687
NameBDBM50389687
TypeSmall organic molecule
Emp. Form.C21H21N5O
Mol. Mass.359.4243
SMILESCC(C)n1nc(-c2ccc3cc(OCC=C)ccc3c2)c2c(N)ncnc12