Reaction Details
TargetCalcium-dependent protein kinase 1
LigandBDBM340930
Substrate/Competitorn/a
Meas. Tech.Biological Assay
IC50 30.7±n/a nM
Citation Van Voorhis, WCHol, WGLarson, ETMaly, DJMerritt, EOjo, KK Compositions and methods for treating toxoplasmosis, cryptosporidiosis, and other apicomplexan protozoan related diseases US Patent US9765037 Publication Date 9/19/2017
 
Calcium-dependent protein kinase 1
Name:Calcium-dependent protein kinase 1
Synonyms:Calcium-dependent protein kinase 1 (CDPK1)
Type:Protein
Mol. Mass.:76617.33
Organism:Cryptosporidium parvum
Description:Q6S4W0
Residue:677
BDBM340930
NameBDBM340930
TypeSmall organic molecule
Emp. Form.C24H22N6O
Mol. Mass.410.4711
SMILESCC(C)n1nc(-c2ccc3cc(OCc4ccncc4)ccc3c2)c2c(N)ncnc12