Reaction Details
TargetCalcium-dependent protein kinase 1
LigandBDBM340932
Substrate/Competitorn/a
Meas. Tech.Biological Assay
IC50 13.4±n/a nM
Citation Van Voorhis, WCHol, WGLarson, ETMaly, DJMerritt, EOjo, KK Compositions and methods for treating toxoplasmosis, cryptosporidiosis, and other apicomplexan protozoan related diseases US Patent US9765037 Publication Date 9/19/2017
 
Calcium-dependent protein kinase 1
Name:Calcium-dependent protein kinase 1
Synonyms:Calcium-dependent protein kinase 1 (CDPK1)
Type:Protein
Mol. Mass.:76617.33
Organism:Cryptosporidium parvum
Description:Q6S4W0
Residue:677
BDBM340932
NameBDBM340932
TypeSmall organic molecule
Emp. Form.C20H23N7
Mol. Mass.361.4435
SMILESCn1ccc2cc(ccc12)-c1nn(CC2CCNCC2)c2ncnc(N)c12