Reaction Details
TargetTyrosine-protein kinase ABL1
LigandBDBM50229961
Substrate/Competitorn/a
Meas. Tech.Inhibition Assay
IC50>20000±n/a nM
Citation Van Voorhis, WCHol, WGLarson, ETMaly, DJMerritt, EOjo, KK Compositions and methods for treating toxoplasmosis, cryptosporidiosis, and other apicomplexan protozoan related diseases US Patent US9765037 Publication Date 9/19/2017
 
Tyrosine-protein kinase ABL1
Name:Tyrosine-protein kinase ABL1
Type:Enzyme
Mol. Mass.:122897.30
Organism:Homo sapiens (Human)
Description:P00519
Residue:1130
BDBM50229961
NameBDBM50229961
Synonyms:1-(1,1-dimethylethyl)-3-(1-naphthalenyl)-1H-pyrazolo[3,4-d]pyrimidin-4-amine 1-NA-PP1 1-tert-butyl-3-naphthalen-1-yl-1H-pyrazolo[3,4-d]pyrimidin-4-amine CHEMBL264406 US11247972, Compound 1 | US9765037, Compound 1
TypeSmall organic molecule
Emp. Form.C19H19N5
Mol. Mass.317.3877
SMILESCC(C)(C)n1nc(-c2cccc3ccccc23)c2c(N)ncnc12