Reaction Details
TargetApoptosis regulator Bcl-2
LigandBDBM341016
Substrate/Competitorn/a
Meas. Tech.Fluorescence Polarisation Assay
IC50 2.90±n/a nM
Citation Casara, PLe Diguarher, THenlin, JStarck, JLe Tiran, ADe Nanteuil, GGeneste, ODavidson, JEMurray, JBChen, IWalmsley, CGraham, CJRay, SMaddox, DBedford, S Indole and pyrrole compounds, a process for their preparation and pharmaceutical compositions containing them US Patent US9765056 Publication Date 9/19/2017
 
Apoptosis regulator Bcl-2
Name:Apoptosis regulator Bcl-2
Type:Homodimer or heterodimer
Mol. Mass.:26269.11
Organism:Homo sapiens (Human)
Description:P10415
Residue:239
BDBM341016
NameBDBM341016
Synonyms:1-(5-Bromo-2-{[(3S)-3-[(4-methylpiperazin-1-yl)methyl]-3,4-dihydroisoquinolin-2(1H)-yl]carbonyl}phenyl)-N-(4-hydroxyphenyl)-5-methyl-N-(1-methyl-1H-indol-5-yl)-1H-pyrrole-3-carboxamide hydrochloride | US9765056, Example 70
TypeSmall organic molecule
Emp. Form.C43H43BrN6O3
Mol. Mass.771.744
SMILESCN1CCN(C[C@@H]2Cc3ccccc3CN2C(=O)c2ccc(Br)cc2-n2cc(cc2C)C(=O)N(c2ccc(O)cc2)c2ccc3n(C)ccc3c2)CC1