Reaction Details
TargetTyrosine-protein phosphatase non-receptor type 2
LigandBDBM14245
Substrate/CompetitorBDBM13466
Meas. Tech.Enzymatic Assay
Temperature298.15±n/a K
Ki 320±n/a nM
Commentsextracted
Citation Wan, ZKLee, JXu, WErbe, DVJoseph-McCarthy, DFollows, BCZhang, YL Monocyclic thiophenes as protein tyrosine phosphatase 1B inhibitors: capturing interactions with Asp48. Bioorg Med Chem Lett16:4941-5 (2006) 
 
Tyrosine-protein phosphatase non-receptor type 2
Name:Tyrosine-protein phosphatase non-receptor type 2
Type:Protein
Mol. Mass.:48481.80
Organism:Homo sapiens (Human)
Description:P17706
Residue:415
BDBM14245
BDBM13466
NameBDBM14245
Synonyms:4-bromo-3-(carboxymethoxy)-5-phenylthiophene-2-carboxylic acid Monocyclic thiophene analog 11
TypeSmall organic molecule
Emp. Form.C13H9BrO5S
Mol. Mass.357.177
SMILESOC(=O)COc1c(Br)c(sc1C(O)=O)-c1ccccc1