Reaction Details
TargetPhosphatidylinositol 4,5-bisphosphate 3-kinase catalytic subunit delta isoform
LigandBDBM341210
Substrate/Competitorn/a
Meas. Tech.TR-FRET assay
IC50 0.500±n/a nM
Citation Evarts, JKaplan, JKim, MNaduthambi, DPatel, LPerreault, SPhillips, GPurvis, II, LJStevens, KLTreiberg, JA Phosphatidylinositol 3-kinase inhibitors US Patent US9765060 Publication Date 9/19/2017
 
Phosphatidylinositol 4,5-bisphosphate 3-kinase catalytic subunit delta isoform
Name:Phosphatidylinositol 4,5-bisphosphate 3-kinase catalytic subunit delta isoform
Type:Enzyme Subunit
Mol. Mass.:119489.41
Organism:Homo sapiens (Human)
Description:O00329
Residue:1044
BDBM341210
NameBDBM341210
Synonyms:(S)-3-(2-(1-((2,6-diamino-5-cyanopyrimidin-4-yl)amino)ethyl)-4-oxo-3-phenyl-3,4-dihydroquinazolin-2-yl)propanamide | US9765060, Compound 37
TypeSmall organic molecule
Emp. Form.C24H23N9O2
Mol. Mass.469.4985
SMILESC[C@H](Nc1nc(N)nc(N)c1C#N)c1nc2cccc(CCC(N)=O)c2c(=O)n1-c1ccccc1